{"text_format":"1","workbook":"xlsx","n_sheets":3,"sheets":["2019","Hoja1","Aux"],"not_rendered":{"charts":0,"images":1,"macros":1,"external_links":1,"defined_names":1,"comments":0,"pivot_tables":0},"unopened":[],"bounds":{"document_bytes":16777216,"sheet_cells":100000,"rows_first":2000,"rows_last":500,"rows_between":2000,"halvings":0,"cell_chars":16384,"cell_head_chars":4096},"cells_cut":0,"cells_raw":0,"read":"whole","date_system":"1900"}

{"sheet":"2019","index":0,"n_rows":1646,"n_cols":10,"rows_kept":1646,"cut":false,"hidden":false,"merged":[]}
["AGIRIA - Expediente","NOIZ - Fecha Dto.","NORI - Adjudicatario","IZF/NAN - CIF/DNI","ZENBATEKOA BEZa barik - Importe sin IVA","ZENBATEKOA BEZ barne - Importe con IVA","ZER - Concepto","IRAUPENA - Duración","AMAIERA DATA - Fecha finalización","OHARRAK - Observaciones"]
["ADO2","01/03 a 30/06","A. INDE EDUCA,S.L.","B95167060",118.50413223140495,143.38999999999999,"SUMINISTRO DE SOPORTE PELOTAS GIGANTES...PARA SAKONETA.-FRA. 2019/232  PP Nº 17/19"]
["ADO1","01/01 a 30/03","A. INDE EDUCA,S.L.","B95167060",296.00000000000006,358.16,"IMPORTE TBJOS DE REPARACION DE MARCADOR SASKIBALOIA EN POLI KANDELAZ.-FRA. 2019/60   PP Nº 5/19"]
["ADO2","01/03 a 30/06","A. INDE EDUCA,S.L.","B95167060",306.50413223140498,370.87,"SUMINISTRO DE CINTURON AQUAROBIC....PARA SAKONETA.-FRA. 2019/246   PP Nº 17/19"]
["ADO1","01/01 a 30/03","ABRA IMPORTACIONES,S.L.","B95302949",146.08264462809916,176.76,"IMPORTE BOTELLAS PERSONALIZADAS ALCALDIA F.190119   PP Nº 11/19"]
["ADO2","01/03 a 30/06","ABRA IMPORTACIONES,S.L.","B95302949",373.50413223140498,451.94,"150 BOTELLAS DE CRISTAL CON FUNDA NEOPRENO PERSONALIZADAS Y CON LOGOTIPO A 1 TINTA-FC.190245 PP Nº 23/19"]
["ADO2","01/03 a 30/06","ABRA SEGURIDAD, S.L.","B95444733",45.000000000000007,54.45,"IMPORTE ASISTENCIA TECNICA .-FRA. 908100139  PP Nº 8/19"]
[76,"2019-05-20","ACIDEKA SL","A48093926",247.06,298.94259999999997,"Suministro a tramitar a través de compras",null,null,"factura 758387 pedido 403"]
[76,"2019-05-20","ACIDEKA SL","A48093926",271.97000000000003,329.08370000000002,"Suministro a tramitar a través de compras",null,null,"factura 758388 pedio 403"]
[76,"2019-06-17","ACIDEKA SL","A48093926",903.75,1093.5374999999999,"Suministro a tramitar a través de compras",null,null,"Factura 759866 nº pedido 504"]
[76,"2019-05-09","ACIDEKA SL","A48093926",903.75,1093.5374999999999,"Suministro a tramitar a través de compras",null,null,"Factura 757933 Nº pedido 380"]
[76,"2019-06-12","ACIDEKA SL","A48093926",1137.22,1376.0362,"Suministro a tramitar a través de compras",null,null,"Factura 759694"]
[76,"2019-01-15","ACIDEKA SL","A48093926",3203.38,3876.09,"Suministro a tramitar a través de compras","PUNTUAL","2019-03-30"," "]
[141,"2019-01-18","ADOS INFORMATICA, SL","B95792784 ",5457.39,6603.4418999999998,"Mantenimiento de las Aplicaciones Informáticas para: 1. Gestión de Compras y Almacenes A2 COMP; 2. Registro y Conformación de Facturas A2REGFAC; 3.Gestión de Inventario y Patrimonio A2INVEN","12 Meses","2019-12-31"]
[5,"2019-01-07","Ados Teatroa S.L.","B20567400",990,1197.8999999999999,"Actuación de Teatro \"El baile de los años\""]
[484,"2019-05-07","Adsis Fundazioa","G81436099",316,382.36,"Raseo parred cobertizo patio Primaria Ikastola Altzaga","PUNTUAL"]
["ADO2","01/03 a 30/06","AED- ARRASATE EUSKALDUN DEZAGUN","G20178133",743.80165289256206,900,"IMPORTE SERV DE ACTUACION BUAH TXABAL .-FRA. 19003           PP Nº 13/19"]
["ADO2","01/03 a 30/06","AEROCAD ROTULACIONES SL","B95528519",323,390.83,"IMPORTE DESROTULACION Y ROTULACION DE PUERTAS DEL VEHICULO 3598JKJ DE POLICIA.-FRA. B19/0142  PP Nº22/19"]
[625,"2019-05-30","AGLOMERADOS DOS R S.L.","B53038055",15000,18150,"Suministro a tramitar a través de compras","7 Meses","2019-03-30"]
["ADO2","01/03 a 30/06","AGROJARDIN ASTIKENE S.L.","B95583340",207.44628099173553,251.01,"SUMINISTRO DE SACO RECOGEDOR, CORREA, SPRAY...PARA JARDINERIA.-FRA. 19/00206   PP Nº 5/19"]
["ADO2","01/03 a 30/06","AGROJARDIN ASTIKENE S.L.","B95583340",391.53719008264466,473.76,"SUMINISTRO DE SPRAY ANTIRESINA, CABLE EMBRAGUE, FILTRO ACEITE...JARDINERIA.-FRA. 19/00859  PP Nº 13/19"]
["ADO2","01/03 a 30/06","AGROJARDIN ASTIKENE S.L.","B95583340",478.47933884297527,578.96,"SUMINISTRO DE MATERIAL PARA JARDINERIA.-FRA. 19/01662       PP Nº 22/19"]
[77,"2019-09-30","AGROJARDIN ASTIKENE SL","B95583340",104.96,127.00159999999998,"Suministro a tramitar a través de compras",null,null,"Factura 18/03012"]
[77,"2019-04-30","AGROJARDIN ASTIKENE SL","B95583340",736.9,891.649,"Suministro a tramitar a través de compras",null,null,"Factura 19/01218 (no pedido por compras)"]
[316,"2019-03-08","AGROJARDIN ASTIKENE SL","B95583340",1383.02,1673.4541999999999,"Reparaciones del mes de Febrero 2019_jardineria",null,null," "]
[205,"2019-02-08","AGROJARDIN ASTIKENE SL","B95583340",1393.38,1685.9898000000001,"Reparación mes Enero",null,null," "]
[77,"2019-01-15","AGROJARDIN ASTIKENE SL","B95583340",1569.1399999999999,1898.6594,"Suministro a tramitar a través de compras","PUNTUAL","2019-03-30"]
[485,"2019-05-07","AGROJARDIN ASTIKENE SL","B95583340",1781.48,2155.5907999999999,"Reparación de la maquinaria de jardinería mes de Abril de 2019",null,null," "]
[341,"2019-04-10","AGROJARDIN ASTIKENE SL","B95583340",2011.61,2434.0481,"Reparación de maquinaria de jardineria mes Marzo 2019"]
[644,"2019-06-04","AGROJARDIN ASTIKENE SL","B95583340",2338.9,2830.069,"Reparación de la maquinaria de jardinería mes de Mayo de 2019"]
[77,"2019-05-31","AGROJARDIN ASTIKENE SL","B95583340",7699.16,9315.9835999999996,"Suministro a tramitar a través de compras",null,null,"Factura 19/01661"]
[372,"2019-04-05","Aire Aire Distribución de espectáculos S.L.","B95230918",1600,1936,"Actuación \"El Baker´s Saloon\" Umore Azoka 2019"]
[397,"2019-04-05","Aire Aire Distribución de espectáculos S.L.","B95230918",3500,4235,"Actuación \"Koselig\" Umore Azoka 2019"]
[398,"2019-04-05","Aire Aire Distribución de espectáculos S.L.","B95230918",3500,4235,"Actuación \"JO-JO\" Umore Azoka 2019",null,null,"Procede: CM-736/18"]
[748,"2019-06-18","Aire Aire Distribución de espectáculos S.L.","B95230918",3700,4477,"LAS XL San Juan Jaiak",null,null," "]
[313,"2019-03-06","Aitor Lachaga García","14608735D",3240,3920.4,"Camisetas II Emakumeen Martxa"]
[782,"2019-06-14","Aitor Lachaga García","14608735D",3675,4446.75,"Camisetas serigrafiadas para campaña UDA 2019","PUNTUAL",null," "]
[311,"2019-03-06","Aitziber Aguinagalde Bilbao","16070631W",140,140,"Charla \"Economía feminist\""]
[238,"2019-02-15","Aixerrota Producciones S.L.","B48669444",2400,2904,"Gestión adquisición de premios, etc…",null,null," "]
["ADO2","01/03 a 30/06","AJA                 SANCHEZ             M.R.","16044762P",27.297520661157026,33.03,"IMPORTE MATERIAL TALLERES KULTUR F.3680  PP Nº 21/19"]
[53,"2019-01-09","Aken, S.Coop. Peq","F95820593",1700,1700,"Impartición acción formativa \"Introducción a la empresa y gestión empresarial\"",null,null," "]
[582,"2019-05-21","Aken, S.Coop. Peq","F95820593",1700,1700,"Impartición acción formativa “ Introducción a la empresa y gestión empresarial”"]
[812,"2019-06-20","Aken, S.Coop. Peq","F95820593",1700,1700,"Acción formativa \"Introducción a la empresa y gestión empresarial"]
[622,"2019-05-29","AKROPOST","A95265195",-15.495799999999999,-18.749917999999997,"Actualizar fact Akropost Concurso Pop Rock Gaztegune",null,null,"Procede: CM-642/2018 Dec. 2725/2018"]
[167,"2019-01-29","AKROPOST","A95265195",15.057,18.218969999999999,"Ampliar Fact. Akropost programa Gabonak Gaztegune"]
[317,"2019-03-08","AKROPOST","A95265195",14.95,18.920000000000002,"Servicios postales","PUNTUAL",null,"Procede: CM-693/18"]
[629,"2019-06-03","AKROPOST","A95265195",16,19.36,"Envíos cartelería  ",null,null,"Procede: CM-497/2019 Dec. 1487"]
[469,"2019-04-25","Akropost","A95265195",44.7,54.087000000000003,"Envíos cartelería y dípticos",null,null," "]
[155,"2019-01-24","AKROPOST","B95135075",338.22,409.24620000000004,"Campaña de Prematriculación: ENVÍO de materiales","PUNTUAL",null," "]
[342,"2019-03-15","AKROPOST","A95265195",636.29999999999995,769.92299999999989,"Colocacion de bandos en portales del IVTM 2019","PUNTUAL",null," "]
[174,"2019-01-29","AKROPOST","A95265195",1885.28,2281.1887999999999,"Recogida-reparto correspondencia entre ayto y otras áreas","3 Meses","2019-03-30"," "]
[427,"2019-04-04","AKROPOST","A95265195",2241.39,2712.0818999999997,"Ampliación importe CM 174/2019-Decreto 382/2019"]
[234,"2019-02-15","Akropost - Servicios postales","A95265195",92.3,111.68299999999999,"Envíos dípticos y carteles"]
["ADO2","01/03 a 30/06","AKROPOST SERVICIOS POSTALES","A95265195",40.611570247933884,49.14,"IMPORTE DISTRIBUCION PUBLIENVIOS BEHARGINTZA F.190144        PP Nº 12/19"]
["ADO2","01/03 a 30/06","AKROPOST SERVICIOS POSTALES","A95265195",63.198347107438018,76.47,"IMPORTE ENTREGA DE 16 ENVIO DE FOLLETOS INFORMATIVOS NUEVA OFERTA FORMATIVA BEHARGINTZA.-FRA. 190049- PROP.PAGOS Nº7/19"]
[588,"2019-05-22","Akropost-Servicios postales","A95265195",325,393.25,"Envío difusión a domicilio a los/as jóvenes que cumplen las condiciones para participar en el programa"]
[590,"2019-05-23","ALABAZAS S.COOP","F95653010",1890,2079,"Ipuin Kontalaria","PUNTUAL",null," "]
[169,"2019-01-29","Alaiki Zerbitzu Gizakulturalak S.L.","B48910525",-34.472000000000001,-37.92,"Minorar Fact. Alaiki Zerbitzu Gizakulturalak S.L. programa Gabonak Gaztegune",null,null," "]
[323,"2019-03-13","Alaiki Zerbitzu Gizakulturalak S.L.","B48910525",635,768.35,"Aurresku y Txistularis",null,null," "]
[743,"2019-06-18","Alaiki Zerbitzu Gizakulturalak S.L.","B48910525",1620,1960.2,"Txistu saioak San Juan Jaiak",null,null," "]
{"$rows_left_out":1587}
{"sheet":"Hoja1","index":1,"n_rows":182,"n_cols":7,"rows_kept":182,"cut":false,"hidden":false,"merged":[]}
[null,"Fecha","PROVEEDOR","CIF","Importe SIN IVA","Importe Con IVA","Concepto"]
[null,"2019-12-31","AQUAN SERVIREINER SL",{"$f":"UPPER(LOOKUP(C2,'[1]PROVEEDORES COMPRAS'!B:B,'[1]PROVEEDORES COMPRAS'!A:A))","v":{"$error":"#N/A"}},20,22,"Factura 723894"]
[null,"2019-09-30","AGROJARDIN ASTIKENE SL",{"$f":"UPPER(LOOKUP(C3,'[1]PROVEEDORES COMPRAS'!B:B,'[1]PROVEEDORES COMPRAS'!A:A))","v":{"$error":"#N/A"}},104.96,127.00159999999998,"Factura 18/03012"]
[null,"2019-06-30","INDUFER",{"$f":"UPPER(LOOKUP(C4,'[1]PROVEEDORES COMPRAS'!B:B,'[1]PROVEEDORES COMPRAS'!A:A))","v":"B95445508"},9.39,{"$f":"1.21*E4","v":11.3619},"Factura1900697 nºpedido 511"]
[null,"2019-06-30","INDUFER",{"$f":"UPPER(LOOKUP(C5,'[1]PROVEEDORES COMPRAS'!B:B,'[1]PROVEEDORES COMPRAS'!A:A))","v":"B95445508"},25,{"$f":"1.21*E5","v":30.25},"Factura 1900696 nº pedido 506"]
[null,"2019-06-30","INDUFER",{"$f":"UPPER(LOOKUP(C6,'[1]PROVEEDORES COMPRAS'!B:B,'[1]PROVEEDORES COMPRAS'!A:A))","v":"B95445508"},30.24,{"$f":"1.21*E6","v":36.590399999999995},"Factura 1900700 nº pedido 512"]
[null,"2019-06-30","MONTTE","B95063517",69.75,84.4,"Factura c19-15188-R nº pedido 533"]
[null,"2019-06-30","INDUFER",{"$f":"UPPER(LOOKUP(C8,'[1]PROVEEDORES COMPRAS'!B:B,'[1]PROVEEDORES COMPRAS'!A:A))","v":"B95445508"},96.94,{"$f":"1.21*E8","v":117.2974},"Factura 1900698 nº pedido 520/528"]
[null,"2019-06-30","CAFÉ BAQUE SL",{"$f":"UPPER(LOOKUP(C9,'[1]PROVEEDORES COMPRAS'!B:B,'[1]PROVEEDORES COMPRAS'!A:A))","v":{"$error":"#N/A"}},121.6,{"$f":"1.1*E9","v":133.76},"Factura 0090205593"]
[null,"2019-06-30","CAFÉ BAQUE SL",{"$f":"UPPER(LOOKUP(C10,'[1]PROVEEDORES COMPRAS'!B:B,'[1]PROVEEDORES COMPRAS'!A:A))","v":{"$error":"#N/A"}},139.65,{"$f":"1.1*E10","v":153.61500000000001},"Factura 0090205594"]
[null,"2019-06-30","MONTTE","B95063517",209.25,253.19,"Factura c19-15189-R nº pedido 535"]
[null,"2019-06-30","INDUFER",{"$f":"UPPER(LOOKUP(C12,'[1]PROVEEDORES COMPRAS'!B:B,'[1]PROVEEDORES COMPRAS'!A:A))","v":"B95445508"},776.63,{"$f":"1.21*E12","v":939.72230000000002},"Factura 1900699 nº pedido 521/497"]
[null,"2019-06-25","HARESI SERVICIOS INFORMATICOS","B95730255",108.9,131.77000000000001,"Factura 20193597 nº pedido 523"]
[null,"2019-06-17","ACIDEKA SL",{"$f":"UPPER(LOOKUP(C14,'[1]PROVEEDORES COMPRAS'!B:B,'[1]PROVEEDORES COMPRAS'!A:A))","v":{"$error":"#N/A"}},903.75,{"$f":"1.21*E14","v":1093.5374999999999},"Factura 759866 nº pedido 504"]
[null,"2019-06-15","INDUFER",{"$f":"UPPER(LOOKUP(C15,'[1]PROVEEDORES COMPRAS'!B:B,'[1]PROVEEDORES COMPRAS'!A:A))","v":"B95445508"},5.3,6.4129999999999994,"Factura 1900651 pedido nº 427"]
[null,"2019-06-15","GRUPO LEIOA XXI, SL",{"$f":"UPPER(LOOKUP(C16,'[1]PROVEEDORES COMPRAS'!B:B,'[1]PROVEEDORES COMPRAS'!A:A))","v":"B95445508"},11.26,13.624599999999999,"Factura 708113"]
[null,"2019-06-15","INDUFER",{"$f":"UPPER(LOOKUP(C17,'[1]PROVEEDORES COMPRAS'!B:B,'[1]PROVEEDORES COMPRAS'!A:A))","v":"B95445508"},33.96,41.0916,"Factura 1900648"]
[null,"2019-06-15","INDUFER",{"$f":"UPPER(LOOKUP(C18,'[1]PROVEEDORES COMPRAS'!B:B,'[1]PROVEEDORES COMPRAS'!A:A))","v":"B95445508"},60.98,73.785799999999995,"Factura 1900653"]
[null,"2019-06-15","GRUPO LEIOA XXI, SL",{"$f":"UPPER(LOOKUP(C19,'[1]PROVEEDORES COMPRAS'!B:B,'[1]PROVEEDORES COMPRAS'!A:A))","v":"B95445508"},64.400000000000006,77.924000000000007,"Factura 708115"]
[null,"2019-06-15","INDUFER",{"$f":"UPPER(LOOKUP(C20,'[1]PROVEEDORES COMPRAS'!B:B,'[1]PROVEEDORES COMPRAS'!A:A))","v":"B95445508"},78.38,94.839799999999997,"Factura 1900652"]
[null,"2019-06-15","INDUFER",{"$f":"UPPER(LOOKUP(C21,'[1]PROVEEDORES COMPRAS'!B:B,'[1]PROVEEDORES COMPRAS'!A:A))","v":"B95445508"},88.08,106.57679999999999,"Factura 1900654 nº pedidos 470/503"]
[null,"2019-06-15","GRUPO LEIOA XXI, SL",{"$f":"UPPER(LOOKUP(C22,'[1]PROVEEDORES COMPRAS'!B:B,'[1]PROVEEDORES COMPRAS'!A:A))","v":"B95445508"},157.99,191.1679,"Factura 708116"]
[null,"2019-06-15","GRUPO LEIOA XXI, SL",{"$f":"UPPER(LOOKUP(C23,'[1]PROVEEDORES COMPRAS'!B:B,'[1]PROVEEDORES COMPRAS'!A:A))","v":"B95445508"},173.02,209.35420000000002,"Factura 708114"]
[null,"2019-06-15","INDUFER",{"$f":"UPPER(LOOKUP(C24,'[1]PROVEEDORES COMPRAS'!B:B,'[1]PROVEEDORES COMPRAS'!A:A))","v":"B95445508"},251.13,303.8673,"Factura 1900650"]
[null,"2019-06-15","INDUFER",{"$f":"UPPER(LOOKUP(C25,'[1]PROVEEDORES COMPRAS'!B:B,'[1]PROVEEDORES COMPRAS'!A:A))","v":"B95445508"},251.13,303.8673,"Factura 1900650 pedidos nº 438/465"]
[null,"2019-06-15","ELECTRO VIZCAYA",{"$f":"UPPER(LOOKUP(C26,'[1]PROVEEDORES COMPRAS'!B:B,'[1]PROVEEDORES COMPRAS'!A:A))","v":{"$error":"#N/A"}},274.5,332.14499999999998,"Factura 209083"]
[null,"2019-06-15","INDUFER",{"$f":"UPPER(LOOKUP(C27,'[1]PROVEEDORES COMPRAS'!B:B,'[1]PROVEEDORES COMPRAS'!A:A))","v":"B95445508"},345.04,417.4984,"Factura 1900649 pedidos nº 458/469/507"]
[null,"2019-06-15","GALDESA SL",{"$f":"UPPER(LOOKUP(C28,'[1]PROVEEDORES COMPRAS'!B:B,'[1]PROVEEDORES COMPRAS'!A:A))","v":"B95445508"},420.59,508.91389999999996,"Factura 269256"]
[null,"2019-06-15","ELECTRO VIZCAYA",{"$f":"UPPER(LOOKUP(C29,'[1]PROVEEDORES COMPRAS'!B:B,'[1]PROVEEDORES COMPRAS'!A:A))","v":{"$error":"#N/A"}},710.7,859.947,"Factura 209084"]
[null,"2019-06-15","GALDESA SL",{"$f":"UPPER(LOOKUP(C30,'[1]PROVEEDORES COMPRAS'!B:B,'[1]PROVEEDORES COMPRAS'!A:A))","v":"B95445508"},748.88,906.14479999999992,"Factura 269259"]
[null,"2019-06-15","GALDESA SL",{"$f":"UPPER(LOOKUP(C31,'[1]PROVEEDORES COMPRAS'!B:B,'[1]PROVEEDORES COMPRAS'!A:A))","v":"B95445508"},846,1023.66,"Factura 269275"]
[null,"2019-06-14","SITHEISA – TRABIO SL",{"$f":"UPPER(LOOKUP(C32,'[1]PROVEEDORES COMPRAS'!B:B,'[1]PROVEEDORES COMPRAS'!A:A))","v":"B95063723"},776.58,{"$f":"1.1*E32","v":854.23800000000017},"Factura 19/251 nº pedido 342"]
[null,"2019-06-13","HARESI SERVICIOS INFORMATICOS","B95730255",61.55,74.48,"factura 20193488"]
[null,"2019-06-13","HARESI SERVICIOS INFORMATICOS","B95730255",189.8,229.66,"factura 20193489"]
[null,"2019-06-12","ACIDEKA SL",{"$f":"UPPER(LOOKUP(C35,'[1]PROVEEDORES COMPRAS'!B:B,'[1]PROVEEDORES COMPRAS'!A:A))","v":{"$error":"#N/A"}},1137.22,{"$f":"1.21*E35","v":1376.0362},"Factura 759694"]
[null,"2019-06-11","MONTTE",{"$f":"UPPER(LOOKUP(C36,'[1]PROVEEDORES COMPRAS'!B:B,'[1]PROVEEDORES COMPRAS'!A:A))","v":"B95063723"},69.75,{"$f":"1.21*E36","v":84.397499999999994},"C19-13548-R"]
[null,"2019-06-07","SUSTRAIAK",{"$f":"UPPER(LOOKUP(C37,'[1]PROVEEDORES COMPRAS'!B:B,'[1]PROVEEDORES COMPRAS'!A:A))","v":"B95063723"},2294.64,{"$f":"1.21*E37","v":2776.5143999999996},20192661]
[null,"2019-06-01","HOTEL HOGAR BIZKAIA SL","B48484166",63.92,77.34,"Factura 902176 nº pedido 434"]
[null,"2019-05-31","PAPELBASK",{"$f":"UPPER(LOOKUP(C39,'[1]PROVEEDORES COMPRAS'!B:B,'[1]PROVEEDORES COMPRAS'!A:A))","v":"B95063723"},0.7,{"$f":"1.21*E39","v":0.84699999999999998},"Factura A19/962"]
[null,"2019-05-31","INDUFER",{"$f":"UPPER(LOOKUP(C40,'[1]PROVEEDORES COMPRAS'!B:B,'[1]PROVEEDORES COMPRAS'!A:A))","v":"B95445508"},12.74,{"$f":"1.21*E40","v":15.4154},"Factura 19005520"]
[null,"2019-05-31","INDUFER",{"$f":"UPPER(LOOKUP(C41,'[1]PROVEEDORES COMPRAS'!B:B,'[1]PROVEEDORES COMPRAS'!A:A))","v":"B95445508"},12.74,{"$f":"1.21*E41","v":15.4154},"Factura 1900544"]
[null,"2019-05-31","INDUFER",{"$f":"UPPER(LOOKUP(C42,'[1]PROVEEDORES COMPRAS'!B:B,'[1]PROVEEDORES COMPRAS'!A:A))","v":"B95445508"},15.36,{"$f":"1.21*E42","v":18.585599999999999},"factura 1900550"]
[null,"2019-05-31","ERCOREKA",{"$f":"UPPER(LOOKUP(C43,'[1]PROVEEDORES COMPRAS'!B:B,'[1]PROVEEDORES COMPRAS'!A:A))","v":{"$error":"#N/A"}},17.38,{"$f":"1.04*E43","v":18.075199999999999},"Factura 850130619"]
[null,"2019-05-31","ERCOREKA",{"$f":"UPPER(LOOKUP(C44,'[1]PROVEEDORES COMPRAS'!B:B,'[1]PROVEEDORES COMPRAS'!A:A))","v":{"$error":"#N/A"}},21.98,{"$f":"1.21*E44","v":26.595800000000001},"Factura 850130619"]
[null,"2019-05-31","INDUFER",{"$f":"UPPER(LOOKUP(C45,'[1]PROVEEDORES COMPRAS'!B:B,'[1]PROVEEDORES COMPRAS'!A:A))","v":"B95445508"},23.54,{"$f":"1.21*E45","v":28.4834},"Factura 1900546"]
[null,"2019-05-31","ERCOREKA",{"$f":"UPPER(LOOKUP(C46,'[1]PROVEEDORES COMPRAS'!B:B,'[1]PROVEEDORES COMPRAS'!A:A))","v":{"$error":"#N/A"}},23.65,{"$f":"1.1*E46","v":26.015000000000001},"Factura 850150619"]
[null,"2019-05-31","ERCOREKA",{"$f":"UPPER(LOOKUP(C47,'[1]PROVEEDORES COMPRAS'!B:B,'[1]PROVEEDORES COMPRAS'!A:A))","v":{"$error":"#N/A"}},23.8,{"$f":"1.21*E47","v":28.797999999999998},"Factura 850150619"]
[null,"2019-05-31","PAPELBASK",{"$f":"UPPER(LOOKUP(C48,'[1]PROVEEDORES COMPRAS'!B:B,'[1]PROVEEDORES COMPRAS'!A:A))","v":"B95063723"},25.94,{"$f":"1.21*E48","v":31.3874},"Factura A19/955"]
[null,"2019-05-31","SERVIRREINER",{"$f":"UPPER(LOOKUP(C49,'[1]PROVEEDORES COMPRAS'!B:B,'[1]PROVEEDORES COMPRAS'!A:A))","v":"B95063723"},27.7,{"$f":"1.04*E49","v":28.808},"Factura 752004"]
[null,"2019-05-31","INDUFER",{"$f":"UPPER(LOOKUP(C50,'[1]PROVEEDORES COMPRAS'!B:B,'[1]PROVEEDORES COMPRAS'!A:A))","v":"B95445508"},30.24,{"$f":"1.21*E50","v":36.590399999999995},"Factura 1900548"]
[null,"2019-05-31","PAPELBASK",{"$f":"UPPER(LOOKUP(C51,'[1]PROVEEDORES COMPRAS'!B:B,'[1]PROVEEDORES COMPRAS'!A:A))","v":"B95063723"},34.200000000000003,41.382000000000005,"Factura A19/957"]
[null,"2019-05-31","INDUFER",{"$f":"UPPER(LOOKUP(C52,'[1]PROVEEDORES COMPRAS'!B:B,'[1]PROVEEDORES COMPRAS'!A:A))","v":"B95445508"},34.82,42.132199999999997,"Factura nº 1900545 nº pedido 466"]
[null,"2019-05-31","PAPELBASK",{"$f":"UPPER(LOOKUP(C53,'[1]PROVEEDORES COMPRAS'!B:B,'[1]PROVEEDORES COMPRAS'!A:A))","v":"B95063723"},36.020000000000003,43.584200000000003,"Factura A/19960"]
[null,"2019-05-31","PAPELBASK",{"$f":"UPPER(LOOKUP(C54,'[1]PROVEEDORES COMPRAS'!B:B,'[1]PROVEEDORES COMPRAS'!A:A))","v":"B95063723"},39.53,47.831299999999999,"Factura A19/964"]
[null,"2019-05-31","PAPELBASK",{"$f":"UPPER(LOOKUP(C55,'[1]PROVEEDORES COMPRAS'!B:B,'[1]PROVEEDORES COMPRAS'!A:A))","v":"B95063723"},39.56,47.867600000000003,"Factura A19/959 nº pedido 417"]
[null,"2019-05-31","SERVIRREINER",{"$f":"UPPER(LOOKUP(C56,'[1]PROVEEDORES COMPRAS'!B:B,'[1]PROVEEDORES COMPRAS'!A:A))","v":"B95063723"},40.479999999999997,{"$f":"1.1*E56","v":44.527999999999999},"Factura 752004"]
[null,"2019-05-31","ERCOREKA",{"$f":"UPPER(LOOKUP(C57,'[1]PROVEEDORES COMPRAS'!B:B,'[1]PROVEEDORES COMPRAS'!A:A))","v":{"$error":"#N/A"}},41.43,{"$f":"1.1*E57","v":45.573},"Factura 850130619"]
[null,"2019-05-31","PAPELBASK",{"$f":"UPPER(LOOKUP(C58,'[1]PROVEEDORES COMPRAS'!B:B,'[1]PROVEEDORES COMPRAS'!A:A))","v":"B95063723"},41.58,{"$f":"1.21*E58","v":50.311799999999998},"Factura A19/961"]
[null,"2019-05-31","SERVIRREINER",{"$f":"UPPER(LOOKUP(C59,'[1]PROVEEDORES COMPRAS'!B:B,'[1]PROVEEDORES COMPRAS'!A:A))","v":"B95063723"},42.35,{"$f":"1.1*E59","v":46.585000000000008},"Factura 749413"]
[null,"2019-05-31","SERVIRREINER",{"$f":"UPPER(LOOKUP(C60,'[1]PROVEEDORES COMPRAS'!B:B,'[1]PROVEEDORES COMPRAS'!A:A))","v":"B95063723"},42.8,{"$f":"1.21*E60","v":51.787999999999997},"Facutura 754780"]
{"$rows_left_out":123}
{"sheet":"Aux","index":2,"n_rows":30,"n_cols":3,"rows_kept":30,"cut":false,"hidden":true,"merged":[]}
["OBRA","12 MESES","14563525H"]
["PRIVADO","11 MESES","A28122125"]
["SERVICIO","10 MESES","A48092985"]
["SUMINISTRO","9 MESES","A48093926"]
[null,"8 MESES","A48115000"]
[null,"7 MESES","A48189526"]
[null,"6 MESES","A48210553"]
[null,"5 MESES","B01305093"]
[null,"4 MESES","B01477322"]
[null,"3 MESES","B48182174"]
[null,"2 MESES","B48252472"]
[null,"1 MES","B48253801"]
[null,"PUNTUAL","B48303671"]
[null,null,"B48484166"]
[null,null,"B48506612"]
[null,null,"B48785810"]
[null,null,"B48919708"]
[null,null,"B48943013"]
[null,null,"B71034557"]
[null,null,"B84198134"]
[null,null,"B95018628"]
[null,null,"B95063517"]
[null,null,"B95144119"]
[null,null,"B95167060"]
[null,null,"B95200812"]
[null,null,"B95276515"]
[null,null,"B95445508"]
[null,null,"B95583340"]
[null,null,"B95698619"]
[null,null,"B95730255"]